{"text_format":"1","workbook":"xlsx","n_sheets":11,"sheets":["Accueil","Instructions","Informations sur l'IMF","Audit GPSE","Tableau_de_bord","Plan_Amelioration","Export_ANSSFD","Paramètres","REF_Indicateurs_GPSE","DATA_Reponses_Evaluation","CALC_Scores"],"not_rendered":{"charts":18,"images":2,"macros":1,"external_links":0,"defined_names":21,"comments":2,"pivot_tables":0},"unopened":[],"bounds":{"document_bytes":16777216,"sheet_cells":100000,"rows_first":2000,"rows_last":500,"rows_between":2000,"halvings":0,"cell_chars":16384,"cell_head_chars":4096},"cells_cut":0,"cells_raw":0,"read":"whole","date_system":"1900"}

{"sheet":"Accueil","index":0,"n_rows":35,"n_cols":12,"rows_kept":35,"cut":false,"hidden":false,"merged":[[26,6,26,15],[10,6,12,15],[22,7,23,14],[15,6,15,10],[20,8,20,12],[14,11,15,13]]}
[]
[]
[]
[]
[]
[]
{"$rows_left_out":30}
{"sheet":"Instructions","index":1,"n_rows":42,"n_cols":10,"rows_kept":42,"cut":false,"hidden":false,"merged":[[41,2,42,9],[7,1,7,10],[12,1,12,10],[23,1,24,3],[8,3,10,4],[8,5,10,6],[18,1,18,4],[33,1,33,10],[30,1,31,4],[13,4,15,6],[29,1,29,10],[19,1,19,10],[20,7,21,10],[20,4,21,6],[26,3,27,7],[1,1,2,10],[13,1,15,3],[23,4,24,6],[20,1,21,3],[38,4,39,6],[8,7,10,8],[18,6,18,10],[8,9,10,10],[3,2,5,9],[34,6,35,10],[13,7,15,10],[17,1,17,10],[8,1,10,2],[30,6,31,10],[34,1,35,5],[23,7,24,10]]}
["ACCUEIL"]
[null,"INSTRUCTIONS D'UTILISATION DE L'OUTIL GPSE BÉNIN"]
["INFORMATIONS SUR L'IMF"]
[null,null,"OBJECTIF DE L'OUTIL\nPermettre aux institutions de microfinance de réaliser leur autoévaluation GPSE de manière structurée avant la mise en production de la plateforme numérique : saisir les données, calculer automatiquement les scores, produire des tableaux de bord et des appréciations qualitatives, puis faciliter la consolidation des données par l'ANSSFD."]
["AUDIT GPSE"]
[]
{"$rows_left_out":37}
{"sheet":"Informations sur l'IMF","index":2,"n_rows":212,"n_cols":16,"rows_kept":212,"cut":false,"hidden":false,"merged":[[11,2,11,5],[12,11,12,13],[17,9,17,10],[32,9,32,10],[202,3,202,4],[199,2,199,5],[11,11,11,13],[16,9,16,10],[14,11,14,13],[32,11,32,13],[5,2,5,5],[34,9,37,13],[30,11,30,13],[8,3,8,5],[7,3,7,5],[25,9,25,10],[15,9,15,10],[31,9,31,10],[24,9,24,10],[30,9,30,10],[16,11,16,13],[9,3,9,5],[15,11,15,13],[31,11,31,13],[11,9,11,10],[27,11,27,13],[1,2,3,5],[29,11,29,13],[37,2,37,5],[211,2,212,5],[27,9,27,10],[203,3,203,4],[6,3,6,5],[12,9,12,10],[25,11,25,13],[28,11,28,13],[29,9,29,10],[24,11,24,13],[205,3,205,4],[20,9,21,13],[14,9,14,10],[23,9,23,13],[208,3,208,4],[204,3,204,4],[28,9,28,10],[17,11,17,13],[201,3,201,4],[187,2,187,3],[207,3,207,4],[206,3,206,4]]}
[]
["ACCUEIL",null,"INFORMATIONS SUR L'IMF",null,null,null,null,null,null,null,null,null,null,null,null,"AUDIT GPSE"]
["INSTRUCTIONS",null,null,null,null,null,null,null,null,null,null,null,null,null,null,"TABLEAU DE BORD"]
[null,null,null,null,null,null,null,null,null,null,null,null,null,null,null,"PLAN D'AMÉLIORATION"]
[]
[null,null,"IDENTIFICATION DE L'AUDITEUR OU DE L'ÉVALUATEUR"]
{"$rows_left_out":207}
{"sheet":"Audit GPSE","index":3,"n_rows":157,"n_cols":14,"rows_kept":157,"cut":false,"hidden":false,"merged":[[156,1,156,13],[7,1,7,9],[142,1,143,3],[142,8,143,10],[1,1,6,9],[146,1,146,13]]}
[]
["ACCUEIL","AUTO-ÉVALUATION DE LA GESTION DE LA PERFORMANCE SOCIALE ET ENVIRONNEMENTALE (GPSE)",null,null,null,null,null,null,null,null,"D1"]
["INSTRUCTIONS",null,null,null,null,null,null,null,null,null,"D2"]
["INFORMATIONS SUR L'IMF",null,null,null,null,null,null,null,null,null,"D3"]
["TABLEAU DE BORD",null,null,null,null,null,null,null,null,null,"D4"]
["PLAN D'AMÉLIORATION",null,null,null,null,null,null,null,null,null,"D5"]
{"$rows_left_out":152}
{"sheet":"Tableau_de_bord","index":4,"n_rows":215,"n_cols":33,"rows_kept":215,"cut":false,"hidden":false,"merged":[[76,2,77,2],[62,2,62,3],[62,4,62,5],[62,6,62,7],[62,8,62,9],[62,10,62,11],[62,12,62,13],[63,2,63,3],[63,4,63,5],[63,6,63,7],[63,8,63,9],[63,10,63,11],[63,12,63,13],[59,12,59,13],[60,2,60,3],[60,4,60,5],[60,6,60,7],[60,8,60,9],[60,10,60,11],[60,12,60,13],[61,2,61,3],[61,4,61,5],[61,6,61,7],[61,8,61,9],[61,10,61,11],[61,12,61,13],[214,5,214,9],[127,8,127,13],[206,2,206,3],[212,2,212,3],[27,2,27,13],[76,5,77,5],[73,8,73,13],[9,5,9,7],[148,10,148,13],[209,5,209,9],[207,2,207,3],[13,2,13,13],[76,10,76,13],[213,11,213,13],[150,10,150,13],[56,2,56,5],[56,6,56,9],[56,10,56,13],[57,2,57,3],[57,4,57,5],[57,6,57,7],[57,8,57,9],[57,10,57,11],[57,12,57,13],[208,11,208,13],[214,2,214,3],[186,10,186,13],[1,2,5,13],[210,11,210,13],[187,10,187,13],[208,5,208,9],[168,10,168,13],[149,10,149,13],[210,5,210,9],[208,2,208,3],[14,2,14,13],[72,2,72,13],[91,2,91,6],[40,2,40,13],[10,5,11,7],[211,5,211,9],[55,2,55,13],[183,10,183,13],[162,2,162,13],[213,5,213,9],[212,5,212,9],[145,2,145,6],[163,2,163,6],[144,2,144,13],[184,10,184,13],[133,10,133,13],[95,10,95,13],[169,10,169,13],[97,10,97,13],[9,2,9,4],[147,10,147,13],[8,2,8,13],[73,2,73,6],[76,4,77,4],[16,2,16,13],[113,10,113,13],[58,2,58,3],[58,4,58,5],[58,6,58,7],[58,8,58,9],[58,10,58,11],[58,12,58,13],[59,2,59,3],[59,4,59,5],[59,6,59,7],[59,8,59,9],[59,10,59,11],[6,2,6,13],[90,2,90,13],[112,10,112,13],[213,2,213,3],[75,10,75,13],[109,2,109,6],[163,8,163,13],[130,10,130,13],[10,2,11,4],[207,11,207,13],[185,10,185,13],[205,2,205,13],[114,10,114,13],[129,10,129,13],[206,5,206,9],[209,11,209,13],[195,2,195,13],[204,2,204,13],[131,10,131,13],[165,10,165,13],[145,8,145,13],[76,3,77,3],[126,2,126,13],[115,10,115,13],[108,2,108,13],[209,2,209,3],[212,11,212,13],[111,10,111,13],[214,11,214,13],[91,8,91,13],[70,2,70,13],[211,2,211,3],[180,2,180,13],[181,8,181,13],[207,5,207,9],[127,2,127,6],[167,10,167,13],[211,11,211,13],[77,10,77,13],[151,10,151,13],[166,10,166,13],[109,8,109,13],[210,2,210,3],[132,10,132,13],[79,10,79,13],[94,10,94,13],[181,2,181,6],[206,11,206,13]]}
[]
["Accueil",null,"TABLEAU DE BORD GPSE - SYNTHÈSE EXÉCUTIVE ET ANALYSE DÉTAILLÉE",null,null,null,null,null,null,null,null,null,null,null,null,null,null,null,null,null,null,null,null,null,null,null,null,null,null,null,null,null,"Synthèse"]
["Instructions",null,null,null,null,null,null,null,null,null,null,null,null,null,null,null,null,null,null,null,null,null,null,null,null,null,null,null,null,null,null,null,"Dimensions"]
["Informations sur l'IMF",null,null,null,null,null,null,null,null,null,null,null,null,null,null,null,null,null,null,null,null,null,null,null,null,null,null,null,null,null,null,null,"Normes"]
["Audit GPSE",null,null,null,null,null,null,null,null,null,null,null,null,null,null,null,null,null,null,null,null,null,null,null,null,null,null,null,null,null,null,null,"Pratiques essentielles"]
["Plan d'amélioration",null,null,null,null,null,null,null,null,null,null,null,null,null,null,null,null,null,null,null,null,null,null,null,null,null,null,null,null,null,null,null,"Profil et finances"]
{"$rows_left_out":210}
{"sheet":"Plan_Amelioration","index":5,"n_rows":86,"n_cols":13,"rows_kept":86,"cut":false,"hidden":false,"merged":[[17,2,17,12],[5,2,9,11],[14,4,14,5],[14,2,14,3],[14,8,14,9],[14,6,14,7],[14,10,14,11],[13,2,13,3],[13,6,13,7],[13,4,13,5],[13,8,13,9],[13,10,13,11],[10,2,10,11],[12,2,12,12]]}
[]
[]
[]
[]
[]
["Accueil",null,"PLAN D’AMÉLIORATION DE LA GESTION DE LA PERFORMANCE SOCIALE ET ENVIRONNEMENTALE (GPSE)"]
{"$rows_left_out":81}
{"sheet":"Export_ANSSFD","index":6,"n_rows":5,"n_cols":178,"rows_kept":5,"cut":false,"hidden":true,"merged":[[0,0,0,12]]}
["Export ANSSFD - Consolidation"]
["Navigation rapide"]
["Instructions","Informations sur l'IMF","Audit GPSE","Tableau de bord","Plan"]
[]
["IMF_Nom_IMF","IMF_Code_IMF","IMF_Catégorie_IMF","IMF_Statut_juridique","IMF_Numéro_agrément","IMF_Date_agrément","IMF_Date_création","IMF_Département","IMF_Commune","IMF_Adresse_siège","IMF_Téléphone","IMF_Email","IMF_Nombre_d_agences","IMF_Nombre_d_agences_en_milieu_rural","IMF_Nombre_d_agences_en_milieu_urbain","IMF_Nombre_de_clients","IMF_Nombre_d_employés","IMF_Total_actifs","IMF_Encours_crédit","IMF_Encours_épargne","IMF_Date_évaluation","IMF_Évaluateur","IMF_Cycle_évaluation","IMF_Observation_générale","IMF_Mission_institutionnelle","IMF_Objectifs_sociaux_et_environnementaux","IMF_Nom_du_PCA","IMF_Nom_du_Directeur_Général","IMF_Existence_comité_audit","IMF_Existence_comité_crédit","IMF_Existence_comité_GPSE","IMF_Responsable_point_focal_GPSE","IMF_Période_des_données","IMF_Devise_des_données","IMF_Taux_de_conversion_USD","IMF_Nombre_de_points_de_services","IMF_Nombre_de_points_de_services_ruraux","IMF_Nombre_de_points_de_services_urbains","IMF_Nombre_de_points_de_services_semi_urbains","IMF_Zone_principale_d_intervention","IMF_Départements_couverts","IMF_Communes_couvertes","IMF_Nombre_d_administrateurs","IMF_Nombre_de_femmes_au_CA","IMF_Nombre_d_hommes_au_CA","IMF_Effectif_total_du_personnel","IMF_Personnel_cadre","IMF_Agents_opérationnels","IMF_Personnel_femmes","IMF_Personnel_hommes","IMF_Personnel_affecté_au_crédit","IMF_Personnel_crédit_femmes","IMF_Personnel_crédit_hommes","IMF_Cadres_femmes","IMF_Cadres_hommes","IMF_Départs_employés_sur_12_mois","IMF_Masse_salariale_totale","IMF_Masse_salariale_femmes","IMF_Masse_salariale_hommes","IMF_Produit_digital_principal","IMF_Service_non_financier_principal","IMF_Détail_produits_digitaux","IMF_Services_non_financiers_proposés","IMF_Portée_services_non_financiers_clients_touchés","IMF_Produit_de_finance_verte","IMF_Produits_de_financement_agricole","IMF_Types_de_produits_d_épargne","IMF_Nombre_d_épargnants","IMF_Nombre_emprunteurs","IMF_Clients_femmes","IMF_Clients_hommes","IMF_Clients_personnes_morales","IMF_Clients_agriculture","IMF_Clients_commerce","IMF_Clients_services","IMF_Clients_finance_verte","IMF_Clients_ruraux","IMF_Clients_urbains","IMF_Détail_clients_par_département","IMF_Emprunteurs_femmes","IMF_Emprunteurs_hommes","IMF_Emprunteurs_ruraux","IMF_Emprunteurs_urbains","IMF_Épargnants_femmes","IMF_Épargnants_hommes","IMF_Réclamations_clients_reçues","IMF_Réclamations_clients_résolues","IMF_Encours_crédit_groupe","IMF_Encours_crédit_individuel","IMF_Encours_crédit_entreprise","IMF_Encours_crédit_individuel_digital","IMF_Encours_crédit_rural","IMF_Encours_crédit_femmes_clientes","IMF_Encours_crédit_finance_verte","IMF_Encours_crédit_agriculture","IMF_Encours_crédit_commerce","IMF_Encours_crédit_services","IMF_Encours_crédit_autres_secteurs","IMF_Encours_moyen_épargne","IMF_Encours_moyen_crédit","IMF_Encours_moyen_crédit_femmes","IMF_Encours_moyen_crédit_agriculture","IMF_Encours_moyen_épargne_femmes","IMF_Dépôts_à_vue","IMF_Dépôts_à_terme","IMF_Épargne_tontine","IMF_Taux_effectif_global","IMF_Méthodologie_de_détermination_du_taux_d_intérêt","IMF_Mode_fixation_taux_produit_crédit_représentatif","IMF_TIA_moyen_portefeuille_crédit","IMF_Outil_utilisé_pour_calculer_le_TIA","IMF_Actif_moyen","IMF_Capitaux_propres_moyens","IMF_Bénéfice_net_après_impôts_et_avant_dons","IMF_Revenus_d_exploitation","IMF_Charges_d_exploitation","IMF_Charges_financières","IMF_Provisions_pour_pertes_sur_prêts","IMF_Revenus_financiers_du_portefeuille","IMF_Portefeuille_brut_moyen_de_prêts","IMF_Solde_impayé_30_jours","IMF_Portefeuille_rééchelonné_renégocié","IMF_Montants_radiés_sur_la_période","IMF_ROA","IMF_ROE","IMF_Autosuffisance_opérationnelle_OSS","IMF_Rendement_du_portefeuille","IMF_Ratio_charges_financières_encours_crédit","IMF_Ratio_charges_exploitation_encours_crédit","IMF_Ratio_charges_exploitation_actif_moyen","IMF_PAR_30_prêts_rééchelonnés","IMF_Taux_abandon_de_créances","IMF_Dernière_inspection_ANSSFD","IMF_Dernier_audit_externe","IMF_Ratio_limitation_des_risques","IMF_Ratio_couverture_emplois_MLT","IMF_Ratio_prets_aux_personnes_liees","IMF_Ratio_signature_unique","IMF_Coefficient_de_liquidite","IMF_Ratio_operations_accessoires","IMF_Taux_dotation_reserve_generale","IMF_Ratio_prises_de_participation","IMF_Ratio_capitalisation_UMOA","IMF_Nombre_de_credits_en_cours","IMF_Nombre_de_credits_decaisses_sur_la_periode","IMF_Montant_des_credits_decaisses_sur_la_periode","IMF_Prets_en_souffrance_UMOA_base_de_calcul","IMF_Provisions_sur_prets_en_souffrance_reprise_ligne_existante","IMF_Actifs_productifs_moyens","IMF_Credit_moyen_decaisse","IMF_Taux_prets_en_souffrance","IMF_Taux_provisionnement_prets_en_souffrance","IMF_Téléphone_auditeur_ou_évaluateur","IMF_Email_auditeur_ou_évaluateur","ID_Export","Code_IMF","Nom_IMF","Date_Evaluation","Evaluateur","Dimension","Code_Norme","Norme","Code_PE","Pratique_Essentielle","Code_Indicateur","Question","Reponse","Score","Justification","Preuve","Observation","Categorie_Reglementaire","ALINUS_Made_in_Benin","Texte_Reglementaire","Reference_Reglementaire","Autorite_Reglementaire","Version_Referentiel","Statut_Export"]

{"sheet":"Paramètres","index":7,"n_rows":173,"n_cols":20,"rows_kept":173,"cut":false,"hidden":true,"merged":[[95,0,95,2],[0,0,0,9],[51,0,51,1],[93,0,93,2],[17,9,17,11],[18,0,18,1],[27,0,27,1],[36,0,36,1],[11,3,11,5],[17,3,17,5],[65,0,65,1],[43,0,43,1],[80,0,80,2]]}
["Paramètres"]
[]
[]
["Types IMF","Catégories IMF","Statuts Juridiques",null,"Statuts Évaluation","Périodes Évaluation","Priorités","Liste_Oui_Non","Liste_Oui_Non_NA","Liste_Zones","Liste_Devises","Liste_Periodicite_Donnees","Liste_Methodes_Taux","Produits_Digitaux","Services_Non_Financiers","Statuts_Action","Communes filtrées (ancienne méthode)",null,null,"Types de produits d’épargne"]
["Mutuelle","Petite","Société coopérative",null,"Brouillon","Trimestre 1","Haute","Oui","Oui","Rural","XOF","Annuel","Constante","Mobile money","Education financière","Non commencé",null,null,null,"Epargne à vue"]
["Coopérative","Moyenne","Société Anonyme",null,"En cours","Trimestre 2","Moyenne","Non","Non","Semi-urbain","USD","Semestriel","Dégressive","USSD","Formation","En cours",null,null,null,"Dépôt à terme"]
{"$rows_left_out":168}
{"sheet":"REF_Indicateurs_GPSE","index":8,"n_rows":72,"n_cols":24,"rows_kept":72,"cut":false,"hidden":true,"merged":[[0,0,0,8],[2,0,2,8]]}
["Appréciation"]
[]
["Référentiel métier des indicateurs GPSE contextualisés pour le Bénin"]
[]
["Dimension","Code_Norme","Norme","Code_PE","Pratique_Essentielle","Code_Indicateur","Indicateur","Question_Evaluation","Type_Reponse","Score_Max","Ponderation","Obligatoire","Categorie_Reglementaire","ALINUS_Made_in_Benin","Importance_Reglementaire","Texte_Reglementaire","Reference_Reglementaire","Autorite_Reglementaire","Observation_Reglementaire","Version_Referentiel","Ordre_Affichage","Norme_BCEAO","Disposition_BCEAO","Couverture_Mapping_v2_19_06"]
["Dimension 1 : Stratégie sociale","1.A","L'institution a une stratégie pour atteindre ses objectifs sociaux.","1.A.1","La stratégie spécifie les clients cibles de l'institution, ses objectifs sociaux et la manière dont l'institution atteindra ces objectifs.","1.A.1.1","La stratégie définit les caractéristiques démographiques et socio-économiques des clients cibles.","La stratégie définit les caractéristiques démographiques et socio-économiques des clients cibles.","Liste",100,1,"Non obligatoire","Opportunité","Oui","Moyenne","Loi N°2012-14 du 21 mars 2012 portant réglementation des systèmes financiers décentralisés en République du Bénin\n\nLoi uniforme portant réglementation de la Microfinance","Loi N°2012-14 du 21 mars 2012 : \nL'article 1er de la loi portant réglementation des SFD dans sa définition des SFD : institution dont l'objet principal est d'offrir des services financiers à des personnes qui n'ont généralement pas accès aux opérations des banques et établissements financiers tels que définis par la loi portant réglementation de la microfinance\n\nArticle 26 : Sous réserve des dispositions particulières de la présente loi et des textes pris pour son application, les statuts des systèmes financiers décentralisés déterminent notamment l'objet et la durée de vie de l'institution, la localisation du siège social, les\nconditions d'adhésion, de suspension, de démission ou d'exclusion des membres, les modes d'administration et de contrôle.\n\nLoi uniforme : \nArticle 3 : Définitions au sens de la présente loi, il faut entendre par : 1. Activité de microfinance : une activité consistant à effectuer, à titre de profession, une ou plusieurs des opérations autorisées visées au chapitre 2 du présent Titre. Cette activité est effectuée par une institution de microfinance au profit de personnes physiques et morales qui n’ont généralement pas accès aux services offerts par les banques et établissements financiers de crédit ;","Bénin / BCEAO","G1 : article 14 de la loi uniforme \nCerise : cet article est non adapté à cet indicateur\nSource : Mapping NUGPSE, indicateur 1.A.1.1","GPSE Bénin / ALINUS – 67 indicateurs – Mapping v2 du 19/06",1,"Instruction N°005-06-2010 déterminant les éléments constitutifs du dossier de demande d'agrément des systèmes financiers décentralisés dans les Etats membres de l'Union Monétaire Ouest Africaine (UMOA) \n\nInstruction N° 017-12-2010  relative à l'organisaiton du contrôle interne au sein des Systèmes Financiers Décentralisés","Article 3 : Documents complémentaires requis des structures faîtières. Toute demande d’agrément émanant d'une structure faîtière (union, fédération et confédération des SFD) comprend, outre les documents prévus à l’article 2, les documents et informations dont la liste figure à l'annexe II à la présente instruction.                                                        \n\nAnnexe de l'instruction  N°006-06-2010\n7. l'organisation de la gouvernance et l'organigramme de l'institution ;\n8. le plan d'affaires sur une période d'au moins trois (3) ans, ainsi que le plan de relève de l'assistance technique et financière, le cas échéant. Le plan d'affaires doit comporter les états financiers prévisionnels (bilan et compte de résultat).\n\nAnnexe Instruction N°017-12-2020 2.4 Gouvernance d'entreprise: Les institutions de microfinance sont tenues de se doter des outils ci-après indispensables à un bon gouvernement d'entreprise : • un plan d'affaires triennal ou quinquennal qui devra faire l'objet  d'évaluations annuelles et d'actualisation en fonction de l'évolution\nde l'environnement, de l'activité et des hypothèses ;","Disponible (mapping v2 19/06)"]
{"$rows_left_out":67}
{"sheet":"DATA_Reponses_Evaluation","index":9,"n_rows":72,"n_cols":19,"rows_kept":72,"cut":false,"hidden":true,"merged":[]}
["DATA_REPONSES_EVALUATION – TABLE TECHNIQUE NORMALISÉE"]
[]
["Cette feuille constitue la table technique centralisée des réponses GPSE. Elle est destinée aux calculs, exports, consolidations et futures automatisations."]
[]
["ID_Reponse","Code_IMF","Nom_IMF","Date_Evaluation","Evaluateur","Dimension","Code_Norme","Norme","Code_PE","Pratique_Essentielle","Code_Indicateur","Question","Réponse","Score","Justification","Preuve","Observation ANSSFD","Index plan amélioration","Priorité plan amélioration"]
[{"$f":"\"REP_\"&TEXT(ROW()-5,\"0000\")","v":"REP_0001"},null,null,null,null,{"$f":"REF_Indicateurs_GPSE!$A$6","v":"Dimension 1 : Stratégie sociale"},{"$f":"REF_Indicateurs_GPSE!$B$6","v":"1.A"},{"$f":"REF_Indicateurs_GPSE!$C$6","v":"L'institution a une stratégie pour atteindre ses objectifs sociaux."},{"$f":"REF_Indicateurs_GPSE!$D$6","v":"1.A.1"},{"$f":"REF_Indicateurs_GPSE!$E$6","v":"La stratégie spécifie les clients cibles de l'institution, ses objectifs sociaux et la manière dont l'institution atteindra ces objectifs."},{"$f":"REF_Indicateurs_GPSE!$F$6","v":"1.A.1.1"},{"$f":"REF_Indicateurs_GPSE!$H$6","v":"La stratégie définit les caractéristiques démographiques et socio-économiques des clients cibles."},null,null,null,null,null,{"$f":"IF(OR(M6=\"Non\",M6=\"Partiellement formalisé\",M6=\"Partiellement appliqué\"),COUNTIF($M$6:M6,\"Non\")+COUNTIF($M$6:M6,\"Partiellement formalisé\")+COUNTIF($M$6:M6,\"Partiellement appliqué\"),\"\")","v":""},{"$f":"IF(R6=\"\",\"\",IF(REF_Indicateurs_GPSE!$L$6=\"Obligatoire\",\"Elevee\",\"Moyenne\"))","v":""}]
{"$rows_left_out":67}
{"sheet":"CALC_Scores","index":10,"n_rows":165,"n_cols":9,"rows_kept":165,"cut":false,"hidden":true,"merged":[[2,0,2,7],[76,0,76,7],[151,0,151,7],[118,0,118,7],[0,0,0,7],[140,0,140,7],[5,0,5,7]]}
["CALC_SCORES – MOTEUR DE CALCUL GPSE"]
[]
["Cette feuille technique transforme les réponses détaillées de DATA_Reponses_Evaluation en scores par indicateur, pratique essentielle, norme, dimension puis score global . Elle sert de moteur aux feuilles Tableau_de_bord et Export_ANSSFD."]
[]
[]
["1. Scores par indicateur"]
{"$rows_left_out":159}